BDBM50357462 CHEMBL1917898
SMILES Oc1ccc(cc1Cl)-c1ccc2c(O)cccc2c1
InChI Key InChIKey=YWYJJXVUJPJENN-UHFFFAOYSA-N
Data  2 IC50
  Tab Delimited (TSV)   2D SDfile   Computed 3D by Vconf -m prep SDfile
Find this compound or compounds like it in BindingDB:
Activity Spreadsheet -- Enzyme Inhibition Constant Data from BindingDB
Found 2 hits for monomerid = 50357462
Target17-beta-hydroxysteroid dehydrogenase type 2(Homo sapiens (Human))
Saarland University
Curated by ChEMBL
LigandPNGBDBM50357462(CHEMBL1917898)
Affinity DataIC50:  307nM. Assay description: Inhibition of human placental microsomal 17beta-HSD2 using [3H]E2 as substrate by HPLC analysis
In DepthDetails ArticlePubMed
Target17-beta-hydroxysteroid dehydrogenase type 1(Homo sapiens (Human))
Saarland University
Curated by ChEMBL
LigandPNGBDBM50357462(CHEMBL1917898)
Affinity DataIC50:  1.13E+3nM. Assay description: Inhibition of human placental cytosolic 17beta-HSD1 using [3H]E1 as substrate by HPLC analysis
In DepthDetails ArticlePubMed