BDBM50357624 CHEMBL1915670
SMILES CN1C[C@@H](COc2ccc(C(=O)Nc3cccc(CC(O)=O)c3)c(C)c2C)Oc2ccccc12
InChI Key InChIKey=HSPRFDKYYWATOH-NRFANRHFSA-N
Data  1 KI  1 IC50
  Tab Delimited (TSV)   2D SDfile   Computed 3D by Vconf -m prep SDfile
Find this compound or compounds like it in BindingDB:
Activity Spreadsheet -- Enzyme Inhibition Constant Data from BindingDB
Found 2 hits for monomerid = 50357624
TargetProstacyclin receptor(Homo sapiens (Human))
Ono Pharmaceutical
Curated by ChEMBL
LigandPNGBDBM50357624(CHEMBL1915670)
Affinity DataKi: >1.00E+4nM. Assay description: Displacement of [3H]Iloprost from human prostanoid IP receptor expressed in CHO cells after 30 mins by liquid scintillation counting
In DepthDetails ArticlePubMed
TargetProstaglandin D2 receptor(Mus musculus)
Ono Pharmaceutical
Curated by ChEMBL
LigandPNGBDBM50357624(CHEMBL1915670)
Affinity DataIC50:  22nM. Assay description: Antagonist activity at mouse prostanoid DP receptor expressed in CHO cells assessed as inhibition of PGD2-induced intracellular cAMP production after...
In DepthDetails ArticlePubMed