BDBM50357767 CHEMBL1916404
SMILES OC(=O)CCCn1ncc2cc(ccc12)-c1noc(n1)-c1cc(cc(c1)C(F)(F)F)C(F)(F)F
InChI Key InChIKey=XDKYMGHOUKZROP-UHFFFAOYSA-N
Data  1 EC50
  Tab Delimited (TSV)   2D SDfile   Computed 3D by Vconf -m prep SDfile
Find this compound or compounds like it in BindingDB:
Activity Spreadsheet -- Enzyme Inhibition Constant Data from BindingDB
Found 1 hit for monomerid = 50357767
TargetSphingosine 1-phosphate receptor 1(Homo sapiens (Human))
Arena Pharmaceuticals
Curated by ChEMBL
LigandPNGBDBM50357767(CHEMBL1916404)
Affinity DataEC50:  4.90nM. Assay description: Agonist activity at human S1P1 receptor expressed in HEK293 cells assessed as inhibition of forskolin-stimulated cAMP production after 1 hr by HTRF a...
In DepthDetails ArticlePubMed