BDBM50358105 CHEMBL1915948
SMILES CN(Cc1cccc(O)c1)C(=O)c1ccc(s1)-c1ccccc1O
InChI Key InChIKey=VFBPLSZZYSKPBA-UHFFFAOYSA-N
Data  2 IC50
  Tab Delimited (TSV)   2D SDfile   Computed 3D by Vconf -m prep SDfile
Find this compound or compounds like it in BindingDB:
Activity Spreadsheet -- Enzyme Inhibition Constant Data from BindingDB
Found 2 hits for monomerid = 50358105
Target17-beta-hydroxysteroid dehydrogenase type 2(Homo sapiens (Human))
Saarland University
Curated by ChEMBL
LigandPNGBDBM50358105(CHEMBL1915948)
Affinity DataIC50:  149nM. Assay description: Inhibition of human placental 17beta-HSD2 assessed as formation of [2,4,6,7-3H]-estrone using [2,4,6,7-3H]-estradiol as substrate after 20 mins by ra...
In DepthDetails ArticlePubMed
Target17-beta-hydroxysteroid dehydrogenase type 1(Homo sapiens (Human))
Saarland University
Curated by ChEMBL
LigandPNGBDBM50358105(CHEMBL1915948)
Affinity DataIC50:  2.98E+3nM. Assay description: Inhibition of human placental 17beta-HSD1 using [2,4,6,7-3H]-estrone as substrate after 10 mins by radio flow detector-based HPLC analysis in presenc...
In DepthDetails ArticlePubMed