BDBM50358286 CHEMBL1922402
SMILES Oc1ccc(C(c2ccc(cc2)[N+]([O-])=O)c2cc(Br)c(O)cc2O)c(O)c1
InChI Key InChIKey=JVHQYPMCINMMEJ-UHFFFAOYSA-N
Data  1 IC50
  Tab Delimited (TSV)   2D SDfile   Computed 3D by Vconf -m prep SDfile
Find this compound or compounds like it in BindingDB:
Activity Spreadsheet -- Enzyme Inhibition Constant Data from BindingDB
Found 1 hit for monomerid = 50358286
TargetIsocitrate lyase(Candida albicans)
University Of East Anglia
Curated by ChEMBL
LigandPNGBDBM50358286(CHEMBL1922402)
Affinity DataIC50:  4.12E+4nM. Assay description: Inhibition of Candida albicans isocitrate lyase after 30 mins
In DepthDetails ArticlePubMed