BDBM50358334 CHEMBL1922683
SMILES Cc1nc(sc1C(=O)Nc1ccc(nc1)N1CCOCC1)-c1ccccc1
InChI Key InChIKey=YWKLVBZNIDNGPW-UHFFFAOYSA-N
Data  1 IC50  1 EC50
  Tab Delimited (TSV)   2D SDfile   Computed 3D by Vconf -m prep SDfile
Find this compound or compounds like it in BindingDB:
Activity Spreadsheet -- Enzyme Inhibition Constant Data from BindingDB
Found 2 hits for monomerid = 50358334
TargetDiacylglycerol O-acyltransferase 1(Homo sapiens (Human))
Roche Research Center
Curated by ChEMBL
LigandPNGBDBM50358334(CHEMBL1922683)
Affinity DataEC50:  1.18E+4nM. Assay description: Inhibition of human DGAT1 expressed in CHOK1 cells using 14C palmitic acid as substrate after 1 hr by TLC analysis
In DepthDetails ArticlePubMed
TargetDiacylglycerol O-acyltransferase 1(Homo sapiens (Human))
Roche Research Center
Curated by ChEMBL
LigandPNGBDBM50358334(CHEMBL1922683)
Affinity DataIC50:  660nM. Assay description: Inhibition of human DGAT1 using palmitoyl-1-14C coenzyme A and DAG as substrate after 1 hr by phospholipid flash plate assay
In DepthDetails ArticlePubMed