BDBM50358434 CHEMBL1922900
SMILES Clc1ccccc1Oc1ccc(Nc2ncnc3cc[nH]c23)cc1Cl
InChI Key InChIKey=AYIGALYNJFDMRN-UHFFFAOYSA-N
Data  1 IC50
  Tab Delimited (TSV)   2D SDfile   Computed 3D by Vconf -m prep SDfile
Find this compound or compounds like it in BindingDB:
Activity Spreadsheet -- Enzyme Inhibition Constant Data from BindingDB
Found 1 hit for monomerid = 50358434
TargetReceptor tyrosine-protein kinase erbB-2(Homo sapiens (Human))
Takeda Pharmaceutical
Curated by ChEMBL
LigandPNGBDBM50358434(CHEMBL1922900)
Affinity DataIC50:  11nM. Assay description: Inhibition of human N-terminus peptide (DYKDDDD)-tagged HER2 expressed in baculovirus infected insect cells using [gamma-32P]ATP as substrate after 6...
In DepthDetails ArticlePubMed