BDBM50358438 CHEMBL1922903
SMILES Clc1cc(Nc2ncnc3cc[nH]c23)ccc1Oc1ccc(cc1)C#N
InChI Key InChIKey=IZUCNCXKMINXNV-UHFFFAOYSA-N
Data  1 IC50
  Tab Delimited (TSV)   2D SDfile   Computed 3D by Vconf -m prep SDfile
Find this compound or compounds like it in BindingDB:
Activity Spreadsheet -- Enzyme Inhibition Constant Data from BindingDB
Found 1 hit for monomerid = 50358438
TargetReceptor tyrosine-protein kinase erbB-2(Homo sapiens (Human))
Takeda Pharmaceutical
Curated by ChEMBL
LigandPNGBDBM50358438(CHEMBL1922903)
Affinity DataIC50:  720nM. Assay description: Inhibition of human N-terminus peptide (DYKDDDD)-tagged HER2 expressed in baculovirus infected insect cells using [gamma-32P]ATP as substrate after 6...
In DepthDetails ArticlePubMed