BDBM50358538 CHEMBL1923537
SMILES CCCCC\C=C/C\C=C/CCCCCCCC(=O)OC[C@H](CSC[C@H](N)C(=O)NCC(=O)OC(C)C)OC(=O)CCCCCCC\C=C/C\C=C/CCCCC
InChI Key InChIKey=ZIJJQGPQSLTPOR-JXCIPMFESA-N
Data  1 EC50
  Tab Delimited (TSV)   2D SDfile   Computed 3D by Vconf -m prep SDfile
Find this compound or compounds like it in BindingDB:
Activity Spreadsheet -- Enzyme Inhibition Constant Data from BindingDB
Found 1 hit for monomerid = 50358538
TargetToll-like receptor 2(Homo sapiens (Human))
University Of Kansas
Curated by ChEMBL
LigandPNGBDBM50358538(CHEMBL1923537)
Affinity DataEC50:  1nM. Assay description: Agonist activity at human TLR2 expressed in HEK293 cells assessed as NF-kappaB induction measured soluble alkaline phosphatase after 12 hrs by spectr...
In DepthDetails ArticlePubMed