BDBM50358610 CHEMBL1921859
SMILES CC[C@H]1CN(CCN1C1CCN(Cc2ccc(OC(F)(F)F)cc2)CC1)c1nc(N)c(nc1Cl)C(N)=O
InChI Key InChIKey=FSQRZWCNEBMUAW-INIZCTEOSA-N
Data  1 IC50
  Tab Delimited (TSV)   2D SDfile   Computed 3D by Vconf -m prep SDfile
Find this compound or compounds like it in BindingDB:
Activity Spreadsheet -- Enzyme Inhibition Constant Data from BindingDB
Found 1 hit for monomerid = 50358610
TargetC-X-C chemokine receptor type 3(Homo sapiens (Human))
Merck Research Laboratories
Curated by ChEMBL
LigandPNGBDBM50358610(CHEMBL1921859)
Affinity DataIC50:  3.70nM. Assay description: Displacement of [125I]CXCL10 from human CXCR3 expressed in mouse BA/F3 cells
In DepthDetails ArticlePubMed