BDBM50358621 CHEMBL1921870
SMILES CC[C@H]1CN(CCN1C1CCN(Cc2ccc(Cl)cc2)CC1)c1nc(N)c(nc1Cl)C(=O)NCCS(C)(=O)=O
InChI Key InChIKey=HUTJXCGDUXXLEB-FQEVSTJZSA-N
Data  1 IC50
  Tab Delimited (TSV)   2D SDfile   Computed 3D by Vconf -m prep SDfile
Find this compound or compounds like it in BindingDB:
Activity Spreadsheet -- Enzyme Inhibition Constant Data from BindingDB
Found 1 hit for monomerid = 50358621
TargetC-X-C chemokine receptor type 3(Homo sapiens (Human))
Merck Research Laboratories
Curated by ChEMBL
LigandPNGBDBM50358621(CHEMBL1921870)
Affinity DataIC50:  6.40nM. Assay description: Displacement of [125I]CXCL10 from human CXCR3 expressed in mouse BA/F3 cells
In DepthDetails ArticlePubMed