BDBM50358855 CHEMBL1923438
SMILES Cc1[nH]c(C(=O)N[C@H]2CCN(C[C@H]2F)c2ncc(s2)C(O)=O)c(Cl)c1Cl
InChI Key InChIKey=BGDGHNSKANYMHF-SFYZADRCSA-N
Data  1 IC50
  Tab Delimited (TSV)   2D SDfile   Computed 3D by Vconf -m prep SDfile
Find this compound or compounds like it in BindingDB:
Activity Spreadsheet -- Enzyme Inhibition Constant Data from BindingDB
Found 1 hit for monomerid = 50358855
TargetDNA gyrase subunit B(Staphylococcus aureus)
Astrazeneca R&D Boston
Curated by ChEMBL
LigandPNGBDBM50358855(CHEMBL1923438)
Affinity DataIC50:  35nM. Assay description: Inhibition of ATPase activity of recombinant Staphylococcus aureus DNA gyrase B hybrid tetramer enzyme reconstituted from Escherichia coli GyrA by am...
In DepthDetails ArticlePubMed