BDBM50359162 CHEMBL1922982
SMILES Cn1cc(\C=C2/C(=O)NN=C2c2nccs2)c2c(OCc3ccc(F)cc3)cccc12
InChI Key InChIKey=SILSDXCCWFMXKP-BOPFTXTBSA-N
Data  1 IC50
  Tab Delimited (TSV)   2D SDfile   Computed 3D by Vconf -m prep SDfile
Find this compound or compounds like it in BindingDB:
Activity Spreadsheet -- Enzyme Inhibition Constant Data from BindingDB
Found 1 hit for monomerid = 50359162
TargetALK tyrosine kinase receptor(Homo sapiens (Human))
Cephalon
Curated by ChEMBL
LigandPNGBDBM50359162(CHEMBL1922982)
Affinity DataIC50:  63nM. Assay description: Inhibition of ALK
In DepthDetails ArticlePubMed