BDBM50359166 CHEMBL1922986
SMILES Cn1cc(\C=C2/C(=O)NN=C2c2nccs2)c2c(OCc3cccc(F)c3F)cccc12
InChI Key InChIKey=OJCSMNPIXLENHY-GDNBJRDFSA-N
Data  3 IC50
  Tab Delimited (TSV)   2D SDfile   Computed 3D by Vconf -m prep SDfile
Find this compound or compounds like it in BindingDB:
Activity Spreadsheet -- Enzyme Inhibition Constant Data from BindingDB
Found 3 hits for monomerid = 50359166
TargetInsulin receptor(Homo sapiens (Human))
Cephalon
Curated by ChEMBL
LigandPNGBDBM50359166(CHEMBL1922986)
Affinity DataIC50:  6.50E+3nM. Assay description: Inhibition of GST-tagged intracellular domain of IR by homogeneous time-resolved fluorescence assay
In DepthDetails ArticlePubMed
TargetALK tyrosine kinase receptor(Homo sapiens (Human))
Cephalon
Curated by ChEMBL
LigandPNGBDBM50359166(CHEMBL1922986)
Affinity DataIC50:  90nM. Assay description: Inhibition of nucleophosmin-fused ALK autophosphorylation in human Karpas299 cells
In DepthDetails ArticlePubMed
TargetALK tyrosine kinase receptor(Homo sapiens (Human))
Cephalon
Curated by ChEMBL
LigandPNGBDBM50359166(CHEMBL1922986)
Affinity DataIC50:  14nM. Assay description: Inhibition of ALK
In DepthDetails ArticlePubMed