BDBM50359241 CHEMBL1923631
SMILES CC[C@H](C)[C@@H]1NCCCCCCCCNC(=O)[C@@H](Cc2ccccc2)NC(=O)[C@@H](C)N(C)C1=O
InChI Key InChIKey=RDONEVHLXOBAHH-SCDRESIJSA-N
Data  1 KI
  Tab Delimited (TSV)   2D SDfile   Computed 3D by Vconf -m prep SDfile
Find this compound or compounds like it in BindingDB:
Activity Spreadsheet -- Enzyme Inhibition Constant Data from BindingDB
Found 1 hit for monomerid = 50359241
TargetAppetite-regulating hormone(Homo sapiens (Human))
Tranzyme Pharma
Curated by ChEMBL
LigandPNGBDBM50359241(CHEMBL1923631)
Affinity DataKi:  1.50E+3nM. Assay description: Displacement of [125I-His9]-ghrelin from human GRLN receptor by radioligand binding assay
In DepthDetails ArticlePubMed