BDBM50359341 CHEMBL1929221
SMILES CC(C)(C)c1cc(C(=O)N2CCNC(=O)C2)c(NC(=O)Nc2cccc3ccccc23)s1
InChI Key InChIKey=MOBGBOCWWCEVPV-UHFFFAOYSA-N
Data  1 IC50
  Tab Delimited (TSV)   2D SDfile   Computed 3D by Vconf -m prep SDfile
Find this compound or compounds like it in BindingDB:
Activity Spreadsheet -- Enzyme Inhibition Constant Data from BindingDB
Found 1 hit for monomerid = 50359341
TargetMitogen-activated protein kinase 14(Homo sapiens (Human))
Ansaris
Curated by ChEMBL
LigandPNGBDBM50359341(CHEMBL1929221)
Affinity DataIC50:  25nM. Assay description: Inhibition of p38alpha assessed as [33P]gamma-ATP incorporation into GST-ATF2 substrate preincubated for 20 mins before substrate addition measured a...
In DepthDetails ArticlePubMed