BDBM50359494 CHEMBL1927014
SMILES OC(=O)\C=C1/CN(Cc2cc(F)c(F)cc2F)S(=O)(=O)c2ccccc12
InChI Key InChIKey=RFMGKJNJIRXRAF-UXBLZVDNSA-N
Data  1 IC50
  Tab Delimited (TSV)   2D SDfile   Computed 3D by Vconf -m prep SDfile
Find this compound or compounds like it in BindingDB:
Activity Spreadsheet -- Enzyme Inhibition Constant Data from BindingDB
Found 1 hit for monomerid = 50359494
TargetAldo-keto reductase family 1 member B1(Rattus norvegicus)
Beijing Institute Of Technology
Curated by ChEMBL
LigandPNGBDBM50359494(CHEMBL1927014)
Affinity DataIC50: >1.00E+4nM. Assay description: Inhibition of Wistar rat kidney ALR1 using D-glucuronate as substrate after 10 mins by UV/VIS double spectrophotometric analysis
In DepthDetails ArticlePubMed