BDBM50359574 CHEMBL1927669
SMILES Cn1c(SCc2ccc(Cl)cc2)nc2n(C)c(=O)n(C)c(=O)c12
InChI Key InChIKey=WYVAFDXXXLTIGO-UHFFFAOYSA-N
Data  2 KI  2 IC50
  Tab Delimited (TSV)   2D SDfile   Computed 3D by Vconf -m prep SDfile
Find this compound or compounds like it in BindingDB:
Activity Spreadsheet -- Enzyme Inhibition Constant Data from BindingDB
Found 4 hits for monomerid = 50359574
TargetAdenosine receptor A2a(Rattus norvegicus (rat))
North-West University
Curated by ChEMBL
LigandPNGBDBM50359574(CHEMBL1927669)
Affinity DataKi:  5.14E+4nM. Assay description: Displacement of [3H]NECA from adenosine receptor A2a in rat striatial membrane
In DepthDetails ArticlePubMed
TargetAdenosine receptor A1(Rattus norvegicus (rat))
North-West University
Curated by ChEMBL
LigandPNGBDBM50359574(CHEMBL1927669)
Affinity DataKi:  9.00E+4nM. Assay description: Displacement of [3H]DPCPX from adenosine receptor A1 in rat brain membrane
In DepthDetails ArticlePubMed
TargetAmine oxidase [flavin-containing] A(Homo sapiens (Human))
North-West University
Curated by ChEMBL
LigandPNGBDBM50359574(CHEMBL1927669)
Affinity DataIC50:  2.77E+3nM. Assay description: Inhibition of human recombinant MAOA using kynuramine as substrate by fluorescence assay
In DepthDetails ArticlePubMed
TargetAmine oxidase [flavin-containing] B(Homo sapiens (Human))
North-West University
Curated by ChEMBL
LigandPNGBDBM50359574(CHEMBL1927669)
Affinity DataIC50:  192nM. Assay description: Inhibition of human recombinant MAOB using kynuramine as substrate by fluorescence assay
In DepthDetails ArticlePubMed