BDBM50359687 CHEMBL1929279::CHEMBL1929431
SMILES CC1(C)CCCN(CCCC2CCCc3sccc23)C1
InChI Key InChIKey=KQSXQUZXGHYYNK-UHFFFAOYSA-N
Data  3 KI
  Tab Delimited (TSV)   2D SDfile   Computed 3D by Vconf -m prep SDfile
Find this compound or compounds like it in BindingDB:
Activity Spreadsheet -- Enzyme Inhibition Constant Data from BindingDB
Found 3 hits for monomerid = 50359687
TargetSigma non-opioid intracellular receptor 1(Cavia porcellus (Guinea pig))
Universit£
Curated by ChEMBL
LigandPNGBDBM50359687(CHEMBL1929279 | CHEMBL1929431)
Affinity DataKi:  0.210nM. Assay description: Displacement of [3H]-(+)-pentazocine from sigma1 receptor in guinea pig brain membranes without cerebellum
In DepthDetails ArticlePubMed
Target3-beta-hydroxysteroid-Delta(8),Delta(7)-isomerase(Cavia porcellus)
Universit£
Curated by ChEMBL
LigandPNGBDBM50359687(CHEMBL1929279 | CHEMBL1929431)
Affinity DataKi:  3.07nM. Assay description: Displacement of [3H]-emopamil from delta(8)-delta(7) sterol isomerase in guinea pig liver membranes
In DepthDetails ArticlePubMed
TargetSigma non-opioid intracellular receptor 1(RAT)
Universit£
Curated by ChEMBL
LigandPNGBDBM50359687(CHEMBL1929279 | CHEMBL1929431)
Affinity DataKi: >3.96E+3nM. Assay description: Binding affinity to sigma1 receptor in rat brain membranes
In DepthDetails ArticlePubMed