BDBM50359703 CHEMBL1929447
SMILES CCC(=O)C(C#N)C(=O)Nc1ccc(c(c1)C(=O)OC)-c1ccc(F)cc1OC
InChI Key InChIKey=SLTXRMBSQFZLPX-UHFFFAOYSA-N
Data  1 IC50
  Tab Delimited (TSV)   2D SDfile   Computed 3D by Vconf -m prep SDfile
Find this compound or compounds like it in BindingDB:
Activity Spreadsheet -- Enzyme Inhibition Constant Data from BindingDB
Found 1 hit for monomerid = 50359703
TargetDihydroorotate dehydrogenase (quinone), mitochondrial(Homo sapiens (Human))
RhôNe-Poulenc Rorer
Curated by ChEMBL
LigandPNGBDBM50359703(CHEMBL1929447)
Affinity DataIC50:  66nM. Assay description: Inhibition of human dihydroorotate dehydrogenase
In DepthDetails ArticlePubMed