BDBM50359709 CHEMBL1929453
SMILES CCC(=O)C(C#N)C(=O)Nc1ccc(-c2cccc(OC3CCC3)c2)c(c1)C(=O)OC
InChI Key InChIKey=HYPFTMFXGJWOSH-UHFFFAOYSA-N
Data  1 IC50
  Tab Delimited (TSV)   2D SDfile   Computed 3D by Vconf -m prep SDfile
Find this compound or compounds like it in BindingDB:
Activity Spreadsheet -- Enzyme Inhibition Constant Data from BindingDB
Found 1 hit for monomerid = 50359709
TargetDihydroorotate dehydrogenase (quinone), mitochondrial(Homo sapiens (Human))
RhôNe-Poulenc Rorer
Curated by ChEMBL
LigandPNGBDBM50359709(CHEMBL1929453)
Affinity DataIC50:  31nM. Assay description: Inhibition of human dihydroorotate dehydrogenase
In DepthDetails ArticlePubMed