BDBM50359796 CHEMBL1928682
SMILES NCC1CCN(CC1)c1ncnc2[nH]c3cnccc3c12
InChI Key InChIKey=MZWQLNVPJPVSQE-UHFFFAOYSA-N
Data  2 IC50
  Tab Delimited (TSV)   2D SDfile   Computed 3D by Vconf -m prep SDfile
Find this compound or compounds like it in BindingDB:
Activity Spreadsheet -- Enzyme Inhibition Constant Data from BindingDB
Found 2 hits for monomerid = 50359796
TargetSerine/threonine-protein kinase Chk2(Homo sapiens (Human))
The Institute Of Cancer Research
Curated by ChEMBL
LigandPNGBDBM50359796(CHEMBL1928682)
Affinity DataIC50:  1.20E+4nM. Assay description: Competitive inhibition of human CHK2 using ATP as substrate by DELFIA
In DepthDetails ArticlePubMed
TargetSerine/threonine-protein kinase Chk1(Homo sapiens (Human))
The Institute Of Cancer Research
Curated by ChEMBL
LigandPNGBDBM50359796(CHEMBL1928682)
Affinity DataIC50:  290nM. Assay description: Competitive inhibition of human CHK1 using ATP as substrate by DELFIA
In DepthDetails ArticlePubMed