BDBM50359823 CHEMBL1928688
SMILES NCCCNc1cc(Nc2cnc(cn2)C#N)ncn1
InChI Key InChIKey=SKITZWDMFBMCLT-UHFFFAOYSA-N
Data  1 IC50
  Tab Delimited (TSV)   2D SDfile   Computed 3D by Vconf -m prep SDfile
Find this compound or compounds like it in BindingDB:
Activity Spreadsheet -- Enzyme Inhibition Constant Data from BindingDB
Found 1 hit for monomerid = 50359823
TargetSerine/threonine-protein kinase Chk1(Homo sapiens (Human))
The Institute Of Cancer Research
Curated by ChEMBL
LigandPNGBDBM50359823(CHEMBL1928688)
Affinity DataIC50:  400nM. Assay description: Competitive inhibition of human CHK1 using ATP as substrate by DELFIA
In DepthDetails ArticlePubMed