BDBM50359870 CHEMBL1929095
SMILES CSc1ccc(COCC#CC(O)c2ccc(F)cc2)cc1
InChI Key InChIKey=QIJREDKEDORFEO-UHFFFAOYSA-N
Data  1 IC50
  Tab Delimited (TSV)   2D SDfile   Computed 3D by Vconf -m prep SDfile
Find this compound or compounds like it in BindingDB:
Activity Spreadsheet -- Enzyme Inhibition Constant Data from BindingDB
Found 1 hit for monomerid = 50359870
TargetPolyunsaturated fatty acid 5-lipoxygenase(Homo sapiens (Human))
University Of Hyderabad
Curated by ChEMBL
LigandPNGBDBM50359870(CHEMBL1929095)
Affinity DataIC50:  1.20E+4nM. Assay description: Inhibition of 5-LOX assessed as decrease in oxygen concentration using arachidonic acid as substrate by polarigraphic method with Clark's oxygen elec...
In DepthDetails ArticlePubMed