BDBM50359901 CHEMBL260886
SMILES COc1cc(\C=C2/S\C(NC2=O)=N/c2nsc3ccccc23)ccc1O
InChI Key InChIKey=MVMPYCDFQNONAY-DHDCSXOGSA-N
Data  3 IC50
  Tab Delimited (TSV)   2D SDfile   Computed 3D by Vconf -m prep SDfile
Find this compound or compounds like it in BindingDB:
Activity Spreadsheet -- Enzyme Inhibition Constant Data from BindingDB
Found 3 hits for monomerid = 50359901
TargetStromelysin-1(Homo sapiens (Human))
University Of Catania
Curated by ChEMBL
LigandPNGBDBM50359901(CHEMBL260886)
Affinity DataIC50:  3.15E+3nM. Assay description: Inhibition of MMP3 catalytic domain (unknown origin) assessed as reduction in hydrolysis of Mca-Pro-Leu-Gly-Leu-Dpa-Ala-Arg-NH2 substrate measured fo...
In DepthDetails ArticlePubMed
TargetSeed linoleate 13S-lipoxygenase-1(Glycine max (soybean))
Alexander Technological Education Institute Of Thessaloniki
Curated by ChEMBL
LigandPNGBDBM50359901(CHEMBL260886)
Affinity DataIC50:  3.39E+4nM. Assay description: Inhibition of soybean LOX type 1 pre-incubated for 4 mins at 7x10'-7 w/v concentration assessed as inhibition of sodium linoleate to 13-hydroperoxyli...
In DepthDetails ArticlePubMed
TargetProstaglandin G/H synthase 1(Ovis aries (Sheep))
Alexander Technological Education Institute Of Thessaloniki
Curated by ChEMBL
LigandPNGBDBM50359901(CHEMBL260886)
Affinity DataIC50: >2.00E+5nM. Assay description: Inhibition of ovine COX1 assessed as PGF2alpha production by enzyme immunoassay
In DepthDetails ArticlePubMed