BDBM50359909 CHEMBL1926849
SMILES CCOC(=O)CCSc1nc2cc(c(Cl)cc2s1)-n1nc(sc1=O)C(C)(C)C
InChI Key InChIKey=MLJGGCXPCLVPBK-UHFFFAOYSA-N
Data  1 KI
  Tab Delimited (TSV)   2D SDfile   Computed 3D by Vconf -m prep SDfile
Find this compound or compounds like it in BindingDB:
Activity Spreadsheet -- Enzyme Inhibition Constant Data from BindingDB
Found 1 hit for monomerid = 50359909
TargetProtoporphyrinogen oxidase(Homo sapiens (Human))
Central China Normal University
Curated by ChEMBL
LigandPNGBDBM50359909(CHEMBL1926849)
Affinity DataKi:  1.28E+3nM. Assay description: Inhibition of human PPO by capillary electrophoresis method
In DepthDetails ArticlePubMed