BDBM50359910 CHEMBL1926687
SMILES CCOC(=O)CCCSc1nc2cc(c(Cl)cc2s1)-n1nc(sc1=O)C(C)(C)C
InChI Key InChIKey=HCRVSYBCHXYJMG-UHFFFAOYSA-N
Data  1 KI
  Tab Delimited (TSV)   2D SDfile   Computed 3D by Vconf -m prep SDfile
Find this compound or compounds like it in BindingDB:
Activity Spreadsheet -- Enzyme Inhibition Constant Data from BindingDB
Found 1 hit for monomerid = 50359910
TargetProtoporphyrinogen oxidase(Homo sapiens (Human))
Central China Normal University
Curated by ChEMBL
LigandPNGBDBM50359910(CHEMBL1926687)
Affinity DataKi:  1.77E+4nM. Assay description: Inhibition of human PPO by capillary electrophoresis method
In DepthDetails ArticlePubMed