BDBM50360114 CHEMBL20283
SMILES Nc1nc2n(COCCP(O)(O)=O)cnc2c(=O)[nH]1
InChI Key InChIKey=MSHDORHYJZBNLS-UHFFFAOYSA-N
Data  1 KI
  Tab Delimited (TSV)   2D SDfile   Computed 3D by Vconf -m prep SDfile
Find this compound or compounds like it in BindingDB:
Activity Spreadsheet -- Enzyme Inhibition Constant Data from BindingDB
Found 1 hit for monomerid = 50360114
TargetHypoxanthine-guanine phosphoribosyltransferase(Homo sapiens (Human))
Academy Of Sciences Of The Czech Republic
Curated by ChEMBL
LigandPNGBDBM50360114(CHEMBL20283)
Affinity DataKi:  3.10E+4nM. Assay description: Inhibition of human HGPRT
In DepthDetails ArticlePubMed