BDBM50360163 CHEMBL1929530
SMILES Cc1cccc(C[C@H](O)\C=C\[C@H]2COC(=O)N2CCSCCCC(O)=O)c1
InChI Key InChIKey=LXIKXYLAOXWTDX-KBSZCIAZSA-N
Data  4 KI  1 EC50
  Tab Delimited (TSV)   2D SDfile   Computed 3D by Vconf -m prep SDfile
Find this compound or compounds like it in BindingDB:
Activity Spreadsheet -- Enzyme Inhibition Constant Data from BindingDB
Found 5 hits for monomerid = 50360163
TargetProstaglandin E2 receptor EP4 subtype(Mus musculus (Mouse))
Minase Research Institute
Curated by ChEMBL
LigandPNGBDBM50360163(CHEMBL1929530)
Affinity DataKi:  2.5nM. Assay description: Displacement of [3H]-PGE2 from mouse EP4 receptor expressed in CHO cells after 60 mins by liquid scintillation counterChecked by Author
In DepthDetails ArticlePubMed
TargetProstaglandin E2 receptor EP3 subtype(Mus musculus (Mouse))
Minase Research Institute
Curated by ChEMBL
LigandPNGBDBM50360163(CHEMBL1929530)
Affinity DataKi:  2.80E+3nM. Assay description: Displacement of [3H]-PGE2 from mouse EP3 receptor expressed in CHO cells after 60 mins by liquid scintillation counterChecked by Author
In DepthDetails ArticlePubMed
TargetProstaglandin E2 receptor EP1 subtype(Mus musculus (Mouse))
Minase Research Institute
Curated by ChEMBL
LigandPNGBDBM50360163(CHEMBL1929530)
Affinity DataKi:  4.40E+3nM. Assay description: Displacement of [3H]-PGE2 from mouse EP1 receptor expressed in CHO cells after 20 mins by liquid scintillation counterChecked by Author
In DepthDetails ArticlePubMed
TargetProstaglandin E2 receptor EP2 subtype(Mus musculus (Mouse))
Minase Research Institute
Curated by ChEMBL
LigandPNGBDBM50360163(CHEMBL1929530)
Affinity DataKi: >1.00E+4nM. Assay description: Displacement of [3H]-PGE2 from mouse EP2 receptor expressed in CHO cells after 60 mins by liquid scintillation counterChecked by Author
In DepthDetails ArticlePubMed
TargetProstaglandin E2 receptor EP4 subtype(Rattus norvegicus)
Minase Research Institute
Curated by ChEMBL
LigandPNGBDBM50360163(CHEMBL1929530)
Affinity DataEC50:  33nM. Assay description: Agonist activity at rat EP4 receptor expressed in CHO cells assessed as cAMP production after 10 mins by radioimmunoassayChecked by Author
In DepthDetails ArticlePubMed