BDBM50360422 CHEMBL1934256
SMILES Fc1ccc2occ(-c3cccc(c3)C(=O)N[C@@H]3CCCc4cc(CN5CCCCC5)ccc34)c(=O)c2c1
InChI Key InChIKey=DWBZPBPIXVLIMT-GDLZYMKVSA-N
Data  1 KI  2 IC50
  Tab Delimited (TSV)   2D SDfile   Computed 3D by Vconf -m prep SDfile
Find this compound or compounds like it in BindingDB:
Activity Spreadsheet -- Enzyme Inhibition Constant Data from BindingDB
Found 3 hits for monomerid = 50360422
TargetB1 bradykinin receptor(Homo sapiens (Human))
Amgen
Curated by ChEMBL
LigandPNGBDBM50360422(CHEMBL1934256)
Affinity DataKi:  398nM. Assay description: Binding affinity to human B1 bradykinin receptor
In DepthDetails ArticlePubMed
TargetB1 bradykinin receptor(Oryctolagus cuniculus)
Amgen
Curated by ChEMBL
LigandPNGBDBM50360422(CHEMBL1934256)
Affinity DataIC50:  393nM. Assay description: Antagonist activity at rabbit B1 bradykinin receptor expressed in CHO cells
In DepthDetails ArticlePubMed
TargetB1 bradykinin receptor(Homo sapiens (Human))
Amgen
Curated by ChEMBL
LigandPNGBDBM50360422(CHEMBL1934256)
Affinity DataIC50:  78nM. Assay description: Antagonist activity at human B1 bradykinin receptor expressed in CHO cells by aqueorin-based calcium flux assay
In DepthDetails ArticlePubMed