BDBM50360425 CHEMBL1934257
SMILES Clc1ccc2c(c1)occ(-c1cccc(c1)C(=O)N[C@@H]1CCCc3cc(CN4CCCCC4)ccc13)c2=O
InChI Key InChIKey=SGNRLILGTPMHPX-GDLZYMKVSA-N
Data  2 IC50
  Tab Delimited (TSV)   2D SDfile   Computed 3D by Vconf -m prep SDfile
Find this compound or compounds like it in BindingDB:
Activity Spreadsheet -- Enzyme Inhibition Constant Data from BindingDB
Found 2 hits for monomerid = 50360425
TargetB1 bradykinin receptor(Oryctolagus cuniculus)
Amgen
Curated by ChEMBL
LigandPNGBDBM50360425(CHEMBL1934257)
Affinity DataIC50: >800nM. Assay description: Antagonist activity at rabbit B1 bradykinin receptor expressed in CHO cells
In DepthDetails ArticlePubMed
TargetB1 bradykinin receptor(Homo sapiens (Human))
Amgen
Curated by ChEMBL
LigandPNGBDBM50360425(CHEMBL1934257)
Affinity DataIC50:  799nM. Assay description: Antagonist activity at human B1 bradykinin receptor expressed in CHO cells by aqueorin-based calcium flux assay
In DepthDetails ArticlePubMed