BDBM50360430 CHEMBL1934431
SMILES CCOC(=O)c1c(C)n(CC2CCCCC2)c(C)c1-c1ccc(cc1)[N+]([O-])=O
InChI Key InChIKey=WVFUTQGXQMYXGX-UHFFFAOYSA-N
Data  2 IC50  1 EC50
  Tab Delimited (TSV)   2D SDfile   Computed 3D by Vconf -m prep SDfile
Find this compound or compounds like it in BindingDB:
Activity Spreadsheet -- Enzyme Inhibition Constant Data from BindingDB
Found 3 hits for monomerid = 50360430
TargetAndrogen receptor(Homo sapiens (Human))
Takeda Pharmaceutical
Curated by ChEMBL
LigandPNGBDBM50360430(CHEMBL1934431)
Affinity DataEC50: >1.00E+4nM. Assay description: Agonist activity at human androgen receptor expressed in COS7 cells assessed as luciferase activity after 24 hrs by reporter gene assay
In DepthDetails ArticlePubMed
TargetAndrogen receptor(Homo sapiens (Human))
Takeda Pharmaceutical
Curated by ChEMBL
LigandPNGBDBM50360430(CHEMBL1934431)
Affinity DataIC50:  310nM. Assay description: Displacement of [17-alpha-methyl-3H]-mibolerone from human androgen receptor expressed in HEK293 derived FreeStyle293F cells after 3 hrs
In DepthDetails ArticlePubMed
TargetAndrogen receptor(Homo sapiens (Human))
Takeda Pharmaceutical
Curated by ChEMBL
LigandPNGBDBM50360430(CHEMBL1934431)
Affinity DataIC50:  3.80E+3nM. Assay description: Antagonist activity at human androgen receptor expressed in COS7 cells assessed as inhibition of DHT-induced luciferase activity after 24 hrs by repo...
In DepthDetails ArticlePubMed