BDBM50360655 CHEMBL1933750
SMILES Cc1ccc(cc1Cl)-c1c2c(CC(C)(C)CC2=O)nn1-c1ccc[nH]1
InChI Key InChIKey=UXBAPGGYJMNERJ-UHFFFAOYSA-N
Data  1 IC50
  Tab Delimited (TSV)   2D SDfile   Computed 3D by Vconf -m prep SDfile
Find this compound or compounds like it in BindingDB:
Activity Spreadsheet -- Enzyme Inhibition Constant Data from BindingDB
Found 1 hit for monomerid = 50360655
TargetProto-oncogene tyrosine-protein kinase Src(Homo sapiens (Human))
Birla Institute Of Technology
Curated by ChEMBL
LigandPNGBDBM50360655(CHEMBL1933750)
Affinity DataIC50: >1.50E+5nM. Assay description: Inhibition of His6-tagged c-Src kinase domain using AEEEIYGEFEAKKKK as substrate pre-incubated for 10 mins before substrate addition measured after 3...
In DepthDetails ArticlePubMed