BDBM50360663 CHEMBL1933758
SMILES CC(C)(C)c1ccc(cc1)-c1c2c(CC(C)(C)CC2=O)nn1-c1ccc(Cl)cc1
InChI Key InChIKey=PRDQFBJDVRSFOC-UHFFFAOYSA-N
Data  1 IC50
  Tab Delimited (TSV)   2D SDfile   Computed 3D by Vconf -m prep SDfile
Find this compound or compounds like it in BindingDB:
Activity Spreadsheet -- Enzyme Inhibition Constant Data from BindingDB
Found 1 hit for monomerid = 50360663
TargetProto-oncogene tyrosine-protein kinase Src(Homo sapiens (Human))
Birla Institute Of Technology
Curated by ChEMBL
LigandPNGBDBM50360663(CHEMBL1933758)
Affinity DataIC50: >1.50E+5nM. Assay description: Inhibition of His6-tagged c-Src kinase domain using AEEEIYGEFEAKKKK as substrate pre-incubated for 10 mins before substrate addition measured after 3...
In DepthDetails ArticlePubMed