BDBM50360689 CHEMBL1934107
SMILES C(N1CCC2(CC1)C=Cc1ccccc21)c1ccc2[nH]c3ccccc3c2c1
InChI Key InChIKey=SXGSUZXOHJURFH-UHFFFAOYSA-N
Data  1 IC50
  Tab Delimited (TSV)   2D SDfile   Computed 3D by Vconf -m prep SDfile
Find this compound or compounds like it in BindingDB:
Activity Spreadsheet -- Enzyme Inhibition Constant Data from BindingDB
Found 1 hit for monomerid = 50360689
TargetMelanin-concentrating hormone receptor 2(Homo sapiens (Human))
Amgen
Curated by ChEMBL
LigandPNGBDBM50360689(CHEMBL1934107)
Affinity DataIC50:  100nM. Assay description: Antagonist activity at human MCHR2 receptor expressed in CHO cells assessed as inhibition of MCH-stimulated Ca2+ flux preincubated for 10 mins prior ...
In DepthDetails ArticlePubMed