BDBM50360703 CHEMBL1934122
SMILES CC(=O)N[C@H]1CC2(CCN(Cc3ccc4[nH]c5ccccc5c4c3)CC2)c2ccccc12
InChI Key InChIKey=FYCCIHGGLTVNRX-MHZLTWQESA-N
Data  1 IC50
  Tab Delimited (TSV)   2D SDfile   Computed 3D by Vconf -m prep SDfile
Find this compound or compounds like it in BindingDB:
Activity Spreadsheet -- Enzyme Inhibition Constant Data from BindingDB
Found 1 hit for monomerid = 50360703
TargetMelanin-concentrating hormone receptor 2(Homo sapiens (Human))
Amgen
Curated by ChEMBL
LigandPNGBDBM50360703(CHEMBL1934122)
Affinity DataIC50:  13nM. Assay description: Antagonist activity at human MCHR2 receptor expressed in CHO cells assessed as inhibition of MCH-stimulated Ca2+ flux preincubated for 10 mins prior ...
In DepthDetails ArticlePubMed