BDBM50360905 CHEMBL1935117
SMILES C[C@@H]1CCCN1CCCOc1ccc(cc1)C1=NNC(=O)CC1c1ccccn1
InChI Key InChIKey=CITBWOHPECEAHH-DIAVIDTQSA-N
Data  2 KI
  Tab Delimited (TSV)   2D SDfile   Computed 3D by Vconf -m prep SDfile
Find this compound or compounds like it in BindingDB:
Activity Spreadsheet -- Enzyme Inhibition Constant Data from BindingDB
Found 2 hits for monomerid = 50360905
TargetHistamine H3 receptor(Homo sapiens (Human))
Cephalon
Curated by ChEMBL
LigandPNGBDBM50360905(CHEMBL1935117)
Affinity DataKi:  9.90nM. Assay description: Displacement of [3H]NAMH from human histamine H3 receptor expressed in CHO cells
In DepthDetails ArticlePubMed
TargetHistamine H3 receptor(Rattus norvegicus (rat))
Cephalon
Curated by ChEMBL
LigandPNGBDBM50360905(CHEMBL1935117)
Affinity DataKi:  21nM. Assay description: Displacement of [3H]NAMH from rat histamine H3 receptor expressed in CHO cells
In DepthDetails ArticlePubMed