BDBM50360972 CHEMBL1935294
SMILES CCc1nc(no1)-c1ccc2oc3cc(ccc3c2c1)S(=O)(=O)N[C@@H](C(C)C)C(O)=O
InChI Key InChIKey=YEALYCAODNUTLF-IBGZPJMESA-N
Data  1 IC50
  Tab Delimited (TSV)   2D SDfile   Computed 3D by Vconf -m prep SDfile
Find this compound or compounds like it in BindingDB:
Activity Spreadsheet -- Enzyme Inhibition Constant Data from BindingDB
Found 1 hit for monomerid = 50360972
TargetMacrophage metalloelastase(Homo sapiens (Human))
Pfizer
Curated by ChEMBL
LigandPNGBDBM50360972(CHEMBL1935294)
Affinity DataIC50:  2.90nM. Assay description: Inhibition of human MMP-12
In DepthDetails ArticlePubMed