BDBM50360991 CHEMBL1935418
SMILES C1CC(C1)N1CCC2(CC1)CCc1cc(O[C@H]3CCOC3)ccc1O2
InChI Key InChIKey=MIXXPXMCFRJNIY-IBGZPJMESA-N
Data  2 KI
  Tab Delimited (TSV)   2D SDfile   Computed 3D by Vconf -m prep SDfile
Find this compound or compounds like it in BindingDB:
Activity Spreadsheet -- Enzyme Inhibition Constant Data from BindingDB
Found 2 hits for monomerid = 50360991
TargetHistamine H3 receptor(Homo sapiens (Human))
Cephalon
Curated by ChEMBL
LigandPNGBDBM50360991(CHEMBL1935418)
Affinity DataKi:  15nM. Assay description: Binding affinity to human histamine H3 receptor
In DepthDetails ArticlePubMed
TargetHistamine H3 receptor(Rattus norvegicus (rat))
Cephalon
Curated by ChEMBL
LigandPNGBDBM50360991(CHEMBL1935418)
Affinity DataKi:  39nM. Assay description: Binding affinity to rat histamine H3 receptor
In DepthDetails ArticlePubMed