BDBM50361106 CHEMBL1933783
SMILES COc1ccc2nc(sc2c1)-n1[nH]c2CCc3ccccc3-c2c1=O
InChI Key InChIKey=RZLGGSYTGLQPKN-UHFFFAOYSA-N
Data  1 IC50
  Tab Delimited (TSV)   2D SDfile   Computed 3D by Vconf -m prep SDfile
Find this compound or compounds like it in BindingDB:
Activity Spreadsheet -- Enzyme Inhibition Constant Data from BindingDB
Found 1 hit for monomerid = 50361106
TargetNatural resistance-associated macrophage protein 2(Homo sapiens (Human))
Xenon Pharmaceuticals
Curated by ChEMBL
LigandPNGBDBM50361106(CHEMBL1933783)
Affinity DataIC50:  330nM. Assay description: Inhibition of human DMT1 expressed in CHO cells assessed as blockage of ferrous influx after 20 mins by calcein fluorescence quenching method
In DepthDetails ArticlePubMed