BDBM50361144 CHEMBL1933773
SMILES Cc1[nH]n(-c2nc3ccc(F)cc3s2)c(=O)c1-c1ccccc1
InChI Key InChIKey=PBYCPTODWNPBCX-UHFFFAOYSA-N
Data  1 IC50
  Tab Delimited (TSV)   2D SDfile   Computed 3D by Vconf -m prep SDfile
Find this compound or compounds like it in BindingDB:
Activity Spreadsheet -- Enzyme Inhibition Constant Data from BindingDB
Found 1 hit for monomerid = 50361144
TargetNatural resistance-associated macrophage protein 2(Homo sapiens (Human))
Xenon Pharmaceuticals
Curated by ChEMBL
LigandPNGBDBM50361144(CHEMBL1933773)
Affinity DataIC50:  390nM. Assay description: Inhibition of human DMT1 expressed in CHO cells assessed as blockage of ferrous influx after 20 mins by calcein fluorescence quenching method
In DepthDetails ArticlePubMed