BDBM50361347 CHEMBL1933832
SMILES CCCCCS(=O)(=O)NC(=O)CCc1cc(OCc2ccccn2)nn1Cc1ccc(Cl)cc1Cl
InChI Key InChIKey=CKSAAHSAZCMIQE-UHFFFAOYSA-N
Data  3 EC50
  Tab Delimited (TSV)   2D SDfile   Computed 3D by Vconf -m prep SDfile
Find this compound or compounds like it in BindingDB:
Activity Spreadsheet -- Enzyme Inhibition Constant Data from BindingDB
Found 3 hits for monomerid = 50361347
TargetPeroxisome proliferator-activated receptor delta(Homo sapiens (Human))
Takeda Pharmaceutical
Curated by ChEMBL
LigandPNGBDBM50361347(CHEMBL1933832)
Affinity DataEC50: >1.00E+4nM. Assay description: Agonist activity at human PPARdelta expressed in COS-1 cells after 2 days by luciferase reporter gene transactivation assay
In DepthDetails ArticlePubMed
TargetPeroxisome proliferator-activated receptor gamma(Homo sapiens (Human))
Takeda Pharmaceutical
Curated by ChEMBL
LigandPNGBDBM50361347(CHEMBL1933832)
Affinity DataEC50:  120nM. Assay description: Agonist activity at full length human PPARgamma1 transfected in human CHOK1 cells co expressing RXRalpha and PPRE after 1 day by luciferase reporter ...
In DepthDetails ArticlePubMed
TargetPeroxisome proliferator-activated receptor alpha(Homo sapiens (Human))
Takeda Pharmaceutical
Curated by ChEMBL
LigandPNGBDBM50361347(CHEMBL1933832)
Affinity DataEC50: >1.00E+4nM. Assay description: Agonist activity at human PPARalpha expressed in COS-1 cells after 1 day by luciferase reporter gene transactivation assay
In DepthDetails ArticlePubMed