BDBM50361515 CHEMBL1939087
SMILES Cc1cc(NS(=O)(=O)c2ccc3NC(=O)CCc3c2)ccc1Cl
InChI Key InChIKey=GTFOCOKDGPLBEK-UHFFFAOYSA-N
Data  1 EC50
  Tab Delimited (TSV)   2D SDfile   Computed 3D by Vconf -m prep SDfile
Find this compound or compounds like it in BindingDB:
Activity Spreadsheet -- Enzyme Inhibition Constant Data from BindingDB
Found 1 hit for monomerid = 50361515
TargetPyruvate kinase PKM(Homo sapiens (Human))
National Human Genome Research Institute
Curated by ChEMBL
LigandPNGBDBM50361515(CHEMBL1939087)
Affinity DataEC50:  560nM. Assay description: Activation of human PKM2 assessed as ATP product formation after 1 hr by luminescent pyruvate kinase-luciferase coupled assay
In DepthDetails ArticlePubMed