BDBM50361528 CHEMBL1939074
SMILES Clc1ccc(NS(=O)(=O)c2ccc3NC(=O)CCc3c2)cc1
InChI Key InChIKey=AISVTQYDRIQDKU-UHFFFAOYSA-N
Data  1 EC50
  Tab Delimited (TSV)   2D SDfile   Computed 3D by Vconf -m prep SDfile
Find this compound or compounds like it in BindingDB:
Activity Spreadsheet -- Enzyme Inhibition Constant Data from BindingDB
Found 1 hit for monomerid = 50361528
TargetPyruvate kinase PKM(Homo sapiens (Human))
National Human Genome Research Institute
Curated by ChEMBL
LigandPNGBDBM50361528(CHEMBL1939074)
Affinity DataEC50:  2.00E+3nM. Assay description: Activation of human PKM2 assessed as ATP product formation after 1 hr by luminescent pyruvate kinase-luciferase coupled assay
In DepthDetails ArticlePubMed