BDBM50361621 CHEMBL1939863
SMILES CCCC(=O)c1cc2cc(ccc2[nH]1)C(N)=O
InChI Key InChIKey=NSMIRZBXLNLXDX-UHFFFAOYSA-N
Data  3 IC50
  Tab Delimited (TSV)   2D SDfile   Computed 3D by Vconf -m prep SDfile
Find this compound or compounds like it in BindingDB:
Activity Spreadsheet -- Enzyme Inhibition Constant Data from BindingDB
Found 3 hits for monomerid = 50361621
TargetMatrix metalloproteinase-14(Homo sapiens (Human))
Boehringer Ingelheim Pharmaceuticals
Curated by ChEMBL
LigandPNGBDBM50361621(CHEMBL1939863)
Affinity DataIC50: >5.00E+5nM. Assay description: Inhibition of human recombinant MMP14 after 60 mins by fluorimetry
In DepthDetails ArticlePubMed
Target72 kDa type IV collagenase(Homo sapiens (Human))
Boehringer Ingelheim Pharmaceuticals
Curated by ChEMBL
LigandPNGBDBM50361621(CHEMBL1939863)
Affinity DataIC50: >5.00E+5nM. Assay description: Inhibition of human recombinant MMP2 after 30 mins by fluorimetry
In DepthDetails ArticlePubMed
TargetCollagenase 3(Homo sapiens (Human))
Boehringer Ingelheim Pharmaceuticals
Curated by ChEMBL
LigandPNGBDBM50361621(CHEMBL1939863)
Affinity DataIC50: >5.00E+5nM. Assay description: Inhibition of human MMP13 expressed in Escherichia coli after 30 mins by fluorimetry
In DepthDetails ArticlePubMed