BDBM50361981 CHEMBL1938408
SMILES C[C@@H](N(CC1CCS(=O)(=O)CC1)C(=O)Cc1ccc(F)c(c1)C(F)(F)F)c1nc2ncccc2c(=O)n1-c1ccc(cc1)C#N
InChI Key InChIKey=HCKSMTZJPHUILQ-LJQANCHMSA-N
Data  3 IC50
  Tab Delimited (TSV)   2D SDfile   Computed 3D by Vconf -m prep SDfile
Find this compound or compounds like it in BindingDB:
Activity Spreadsheet -- Enzyme Inhibition Constant Data from BindingDB
Found 3 hits for monomerid = 50361981
TargetC-X-C chemokine receptor type 3(Homo sapiens (Human))
Amgen
Curated by ChEMBL
LigandPNGBDBM50361981(CHEMBL1938408)
Affinity DataIC50:  39nM. Assay description: Antagonist activity at CXCR3 assessed as inhibition of ITAC-mediated cell migration in presence of 100% human serum
In DepthDetails ArticlePubMed
TargetC-X-C chemokine receptor type 3(Homo sapiens (Human))
Amgen
Curated by ChEMBL
LigandPNGBDBM50361981(CHEMBL1938408)
Affinity DataIC50:  8nM. Assay description: Displacement of [125I]-IP-10 from CXCR3
In DepthDetails ArticlePubMed
TargetC-X-C chemokine receptor type 3(Homo sapiens (Human))
Amgen
Curated by ChEMBL
LigandPNGBDBM50361981(CHEMBL1938408)
Affinity DataIC50:  12nM. Assay description: Displacement of [125I]-IP-10 from CXCR3 in presence of 100% human serum
In DepthDetails ArticlePubMed