BDBM50362039 CHEMBL1939918
SMILES COc1cc(C)c2nc3[nH]nc(C)c3c(CN3C[C@H](C)O[C@H](C)C3)c2c1
InChI Key InChIKey=CTONZNNWGOKLGZ-BETUJISGSA-N
Data  1 KI
  Tab Delimited (TSV)   2D SDfile   Computed 3D by Vconf -m prep SDfile
Find this compound or compounds like it in BindingDB:
Activity Spreadsheet -- Enzyme Inhibition Constant Data from BindingDB
Found 1 hit for monomerid = 50362039
TargetcAMP and cAMP-inhibited cGMP 3',5'-cyclic phosphodiesterase 10A(Homo sapiens (Human))
Merck Research Laboratories
Curated by ChEMBL
LigandPNGBDBM50362039(CHEMBL1939918)
Affinity DataKi:  26nM. Assay description: Displacement of [3H]cAMP from human recombinant PDE10A1 by competitive binding assay
In DepthDetails ArticlePubMed