BDBM50362172 CHEMBL1938684
SMILES Clc1ccc(cc1)-c1cc2Cc3cc(ccc3-n3ccnc3-c2o1)N1CCNCC1
InChI Key InChIKey=MEYZYVFRRYUEJP-UHFFFAOYSA-N
Data  1 IC50  1 EC50
  Tab Delimited (TSV)   2D SDfile   Computed 3D by Vconf -m prep SDfile
Find this compound or compounds like it in BindingDB:
Activity Spreadsheet -- Enzyme Inhibition Constant Data from BindingDB
Found 2 hits for monomerid = 50362172
TargetMAP kinase-activated protein kinase 2(Homo sapiens (Human))
Merck Research Laboratories
Curated by ChEMBL
LigandPNGBDBM50362172(CHEMBL1938684)
Affinity DataEC50:  1.50E+3nM. Assay description: Inhibition of MK2-mediated HSP27 phosphorylation at Ser78 in LPS-stimulated human THP-1 cells pre-incubated for 60 mins before LPS treatment measured...
In DepthDetails ArticlePubMed
TargetMAP kinase-activated protein kinase 2(Homo sapiens (Human))
Merck Research Laboratories
Curated by ChEMBL
LigandPNGBDBM50362172(CHEMBL1938684)
Affinity DataIC50:  7nM. Assay description: Inhibition of MK2 using TAMRA-labeled peptide as substrate pre-incubated for 30 mins prior substrate addition measured after 30 mins incubation in da...
In DepthDetails ArticlePubMed