BDBM50362264 CHEMBL1939575
SMILES CCC(CC)c1cc(C)n2nc(c(C)cc12)-c1cc2OCOc2cc1C
InChI Key InChIKey=UBDBGSWWAIWABV-UHFFFAOYSA-N
Data  1 IC50  1 EC50
  Tab Delimited (TSV)   2D SDfile   Computed 3D by Vconf -m prep SDfile
Find this compound or compounds like it in BindingDB:
Activity Spreadsheet -- Enzyme Inhibition Constant Data from BindingDB
Found 2 hits for monomerid = 50362264
TargetCorticotropin-releasing factor receptor 1(Homo sapiens (Human))
Minase Research Institute
Curated by ChEMBL
LigandPNGBDBM50362264(CHEMBL1939575)
Affinity DataEC50:  2.5nM. Assay description: Antagonist activity at human CRF1 receptor expressed in CHO-K1 cells assessed as CRF-stimulated cAMP accumulation by enzyme immunoassay
In DepthDetails ArticlePubMed
TargetCorticotropin-releasing factor receptor 1(Homo sapiens (Human))
Minase Research Institute
Curated by ChEMBL
LigandPNGBDBM50362264(CHEMBL1939575)
Affinity DataIC50:  18.3nM. Assay description: Displacement of [125I]CRF from human CRF1 receptor expressed in CHO-K1 cells after 2 hrs by gamma counter
In DepthDetails ArticlePubMed