BDBM50362287 CHEMBL1939586
SMILES CCC(CC)c1cc(C)n2nc(-c3ccc(OC)cc3C)n(C(C)C)c(=O)c12
InChI Key InChIKey=PZLQAFGVFCLEKG-UHFFFAOYSA-N
Data  1 IC50  1 EC50
  Tab Delimited (TSV)   2D SDfile   Computed 3D by Vconf -m prep SDfile
Find this compound or compounds like it in BindingDB:
Activity Spreadsheet -- Enzyme Inhibition Constant Data from BindingDB
Found 2 hits for monomerid = 50362287
TargetCorticotropin-releasing factor receptor 1(Homo sapiens (Human))
Minase Research Institute
Curated by ChEMBL
LigandPNGBDBM50362287(CHEMBL1939586)
Affinity DataIC50:  19.2nM. Assay description: Displacement of [125I]CRF from human CRF1 receptor expressed in CHO-K1 cells after 2 hrs by gamma counter
In DepthDetails ArticlePubMed
TargetCorticotropin-releasing factor receptor 1(Homo sapiens (Human))
Minase Research Institute
Curated by ChEMBL
LigandPNGBDBM50362287(CHEMBL1939586)
Affinity DataEC50:  5.10nM. Assay description: Antagonist activity at human CRF1 receptor expressed in CHO-K1 cells assessed as CRF-stimulated cAMP accumulation by enzyme immunoassay
In DepthDetails ArticlePubMed